{"text_format":"1","workbook":"xlsx","n_sheets":8,"sheets":["Cover","Input","Output","Stoffdaten","ArtikelNr.","Language","Be-Um-rechnung","Düsen Blendenkit"],"not_rendered":{"charts":0,"images":9,"macros":1,"external_links":0,"defined_names":5,"comments":3,"pivot_tables":0},"unopened":[],"bounds":{"document_bytes":16777216,"sheet_cells":100000,"rows_first":2000,"rows_last":500,"rows_between":2000,"halvings":0,"cell_chars":16384,"cell_head_chars":4096},"cells_cut":0,"cells_raw":0,"read":"whole","date_system":"1900"}

{"sheet":"Cover","index":0,"n_rows":36,"n_cols":8,"rows_kept":36,"cut":false,"hidden":false,"merged":[[25,5,26,5]]}
[]
[null,null,{"$f":"F26","v":2}]
[null,null,1,{"$f":"Language!E2","v":"Deutsch"},null,null,null,{"$f":"Input!A1","v":"Version 1.7 : JT 131118 Gen2"}]
[null,null,2,{"$f":"Language!F2","v":"English"}]
[null,null,3,{"$f":"Language!G2","v":"Français"}]
[null,null,4,{"$f":"Language!H2","v":"Italiano"}]
[null,null,5,{"$f":"Language!I2","v":"Español"}]
[null,null,6,{"$f":"Language!J2","v":"Polish"}]
[null,null,7,{"$f":"Language!K2","v":"…"}]
[null,null,8,{"$f":"Language!L2","v":"…"}]
[null,null,9,{"$f":"Language!M2","v":"…"}]
[]
[]
[]
[]
[]
[]
[]
[]
[]
{"$rows_left_out":17}
{"sheet":"Input","index":1,"n_rows":31,"n_cols":10,"rows_kept":31,"cut":false,"hidden":false,"merged":[[14,0,14,1],[3,2,3,6],[26,8,26,9]]}
["Version 1.7 : JT 131118 Gen2"]
[]
[]
[null,null,{"$f":"Language!D13","v":"Please enter only one pressure value!"}]
[null,null,{"$f":"Language!D6","v":"Compressor discharge pressure"},null,null,{"$f":"Language!D7","v":"Minimum inlet pressure"}]
[null,null,7.5,null,null,{"$f":"IF('Be-Um-rechnung'!A20=1,C6-0.5,C6-7)","v":7}]
[null,null,{"$f":"IF('Be-Um-rechnung'!$A$20=1,IF('Be-Um-rechnung'!$A$20=2,Language!$D$31,IF(Input!C6<5.5,Language!$D$31,IF(Input!C6>15.5,Language!$D$31,\" \"))),IF(Input!C6<80,Language!$D$31,IF(Input!C6>225,Language!$D$31,\" \")))","v":" "},null,null,{"$f":"IF('Be-Um-rechnung'!$A$20=1,IF('Be-Um-rechnung'!$A$20=2,Language!$D$33,IF(Input!F6<5,Language!$D$33,IF(Input!F6>15,Language!$D$33,\" \"))),IF(Input!F6<73,Language!$D$33,IF(Input!F6>217,Language!$D$33,\" \")))","v":" "}]
[]
[]
[]
[]
[]
[]
[]
[{"$f":"Language!D5","v":"Compressed air flow rate \nat 20°C and 1 bar a"}]
[8]
[{"$f":"IF('Be-Um-rechnung'!C9>Stoffdaten!M33,Language!D11,\" \")","v":" "}]
[]
[]
[]
{"$rows_left_out":12}
{"sheet":"Output","index":2,"n_rows":35,"n_cols":5,"rows_kept":35,"cut":false,"hidden":false,"merged":[[27,2,27,3],[26,2,26,3],[0,0,0,4],[20,2,20,3],[22,2,22,3],[23,2,23,3],[24,2,24,3]]}
[{"$f":"Language!D14","v":"Dryer in accordance with standard specification"}]
[{"$f":"Input!A1","v":"Version 1.7 : JT 131118 Gen2"}]
["K-MT",{"$f":"IF(C5=ArtikelNr.!B3,Stoffdaten!N2,\"#NV\")","v":1},{"$f":"Language!D17","v":"Without dew-point dependant-switching \n(fixed cycle)"},{"$f":"Language!D18","v":"With dew-point dependant-switching \n(variable cycle)"}]
[]
[{"$f":"Language!D20","v":"Order Number/Catalogue Number"},null,{"$f":"IF('Be-Um-rechnung'!C4<=Stoffdaten!W2,ArtikelNr.!B3, Language!D11)","v":"K1/16D2-G230M"},{"$f":"IF('Be-Um-rechnung'!C4<=Stoffdaten!W2,ArtikelNr.!C3,Language!D11)","v":"K1/16D2-G230MT"}]
[]
[{"$f":"Language!D5","v":"Compressed air flow rate \nat 20°C and 1 bar a"},null,{"$f":"'Be-Um-rechnung'!B29","v":8},{"$f":"'Be-Um-rechnung'!B29","v":8},{"$f":"'Be-Um-rechnung'!C29","v":"m³/h"}]
[{"$f":"Input!F5","v":"Minimum inlet pressure"},null,{"$f":"'Be-Um-rechnung'!B20","v":7},{"$f":"'Be-Um-rechnung'!B20","v":7},{"$f":"'Be-Um-rechnung'!C20","v":"bar g"}]
[{"$f":"Input!F25","v":"Maximum inlet temperature"},null,{"$f":"'Be-Um-rechnung'!B14","v":35},{"$f":"'Be-Um-rechnung'!B14","v":35},{"$f":"'Be-Um-rechnung'!C14","v":"°C"}]
[{"$f":"Input!I25","v":"Outlet pressure dewpoint"},null,{"$f":"'Be-Um-rechnung'!B39","v":"-40"},{"$f":"'Be-Um-rechnung'!B39","v":"-40"},{"$f":"'Be-Um-rechnung'!D39","v":"°C"}]
[{"$f":"Language!D19","v":"Average purge-air consumption"},null,{"$f":"IF('Be-Um-rechnung'!C4<=Stoffdaten!W2,ROUND(Stoffdaten!AC2,1), \"#NV\")","v":1.2},{"$f":"IF('Be-Um-rechnung'!C4<=Stoffdaten!W2,ROUND(Stoffdaten!AJ2,1), \"#NV\")","v":1.1000000000000001},{"$f":"'Be-Um-rechnung'!C29","v":"m³/h"}]
[{"$f":"Language!D21","v":"Average outlet flow rate"},null,{"$f":"IF('Be-Um-rechnung'!C4<=Stoffdaten!W2,ROUND((C7-C11),1), \"#NV\")","v":6.8},{"$f":"IF('Be-Um-rechnung'!C4<=Stoffdaten!W2,ROUND((D7-D11),1), \"#NV\")","v":6.9},{"$f":"'Be-Um-rechnung'!C29","v":"m³/h"}]
[]
[{"$f":"Language!D39","v":"cycle  - total"},null,{"$f":"C15*2","v":10},{"$f":"D15*2","v":10.185675036861921},"min"]
[{"$f":"Language!D40","v":"adsorption"},null,{"$f":"Stoffdaten!AO34","v":5},{"$f":"Stoffdaten!AF33","v":5.0928375184309607},"min"]
[{"$f":"Language!D41","v":"regeneration"},null,{"$f":"Stoffdaten!AS36","v":4},{"$f":"C16","v":4},"min"]
[{"$f":"Language!D42","v":"pressurization"},null,1,{"$f":"C17","v":1},"min"]
[{"$f":"Language!D43","v":"Standby"},null,{"$f":"C14-C15-C16-C17","v":0},{"$f":"D14-D15-D16-D17","v":9.2837518430960664E-2},"min"]
[]
[{"$f":"IF(AND('Düsen Blendenkit'!B3=1,'Düsen Blendenkit'!B5<=95),IF(Stoffdaten!O2='Düsen Blendenkit'!H27,\" \",Language!D22),\" \")","v":" "},null,{"$f":"IF(AND('Düsen Blendenkit'!B3=1,'Düsen Blendenkit'!B5<=95),IF(Stoffdaten!O2='Düsen Blendenkit'!H27,\" \",'Düsen Blendenkit'!H27),\" \")","v":" "},{"$f":"IF(AND('Düsen Blendenkit'!B3=1,'Düsen Blendenkit'!B5<=95),IF(Stoffdaten!P2='Düsen Blendenkit'!H44,\" \",'Düsen Blendenkit'!H44),\" \")","v":" "},{"$f":"IF(AND('Düsen Blendenkit'!B3=1,'Düsen Blendenkit'!B5<=95),IF(Stoffdaten!O2='Düsen Blendenkit'!H27,\" \",\"mm\"),\" \")","v":" "}]
{"$rows_left_out":16}
{"sheet":"Stoffdaten","index":3,"n_rows":158,"n_cols":45,"rows_kept":158,"cut":false,"hidden":true,"merged":[[11,2,11,7],[26,0,26,7],[9,2,9,7],[47,26,47,30]]}
[null,null,"W-Verweis",null,"S-Verweis",null,"Korrekturfaktor",null,null,null,null,null,"V in m³/h","TYP K-MT","Düse ohne ZHM","Düse mit ZHM",null,null,null,null,null,null,null,null,null,"mittlerer Luftbedarf Starrrer Zyklus Taupunktabhängig",null,null,null,null,null,"mittlerer Luftbedarf variabler Zyklus"]
[null,null,{"$f":"HLOOKUP('Be-Um-rechnung'!C5,C13:H14,2)","v":3},null,{"$f":"VLOOKUP('Be-Um-rechnung'!C4,Stoffdaten!B15:H25,C2+1)","v":1},null,{"$f":"IF('Be-Um-rechnung'!C6<-41,Stoffdaten!E3*Stoffdaten!A27,Stoffdaten!E3)","v":1},null,null,null,null,null,{"$f":"VLOOKUP(N2,$L$10:N33,2)","v":8.0000000999999994},{"$f":"VLOOKUP('Be-Um-rechnung'!C9,Stoffdaten!$M$9:N33,2)","v":1},{"$f":"VLOOKUP(N2,Stoffdaten!L9:O33,4)","v":0.7},{"$f":"VLOOKUP(N2,Stoffdaten!L9:P33,5)","v":0.7},{"$f":"VLOOKUP(N2,Stoffdaten!L9:Q33,6)","v":1E-3},{"$f":"VLOOKUP(N2,Stoffdaten!L9:R33,7)","v":0.8},{"$f":"VLOOKUP(N2,Stoffdaten!L9:S33,8)","v":1.17},{"$f":"VLOOKUP(N2,Stoffdaten!L9:T33,9)","v":"326 x 400 x 216"},{"$f":"VLOOKUP(N2,Stoffdaten!L9:U33,10)","v":11.5},{"$f":"VLOOKUP(N2,Stoffdaten!L9:V33,11)","v":"1/4  \""},{"$f":"VLOOKUP(N2,Stoffdaten!L9:W33,12)","v":16},null,"für Regeneration &",null,{"$f":"Z48*AA48/AF34+Z54","v":1.1616644738483843},"m³/h",{"$f":"SUM(Z5:AC5)","v":1.1616644738483843},null,"m³/h",{"$f":"AF48*AF35/AF33+AF54","v":1.1404884503425887},"Durchn. Luftbedarf gesammt",null,null,{"$f":"SUM(AG5:AJ5)","v":1.1404884503425887}]
[null,null,null,null,{"$f":"IF(ISNA(E2),0,E2)","v":1},null,null,null,null,null,null,null,null,null,null,null,null,null,null,null,null,null,null,null,"Druckaufbau",null,{"$f":"100/'Be-Um-rechnung'!C3*Stoffdaten!AA2","v":14.520805923104804},"%",null,null,"%",{"$f":"100/'Be-Um-rechnung'!C3*Stoffdaten!AF2","v":14.256105629282359},"Durchn. Luftbedarf gesammt"]
[null,null,null,null,null,null,null,null,null,null,null,null,null,null,null,null,null,null,null,null,null,null,null,null,null,"L/sec","m³/min","m³/h","cfm",null,null,null,"L/sec","m³/min","m³/h","cfm"]
[null,null,null,null,null,null,null,null,null,null,null,null,null,null,null,null,null,null,null,null,null,null,null,null,"m³/h",{"$f":"IF('Be-Um-rechnung'!A29=1,Stoffdaten!AA2*0.27777778,0)","v":0},{"$f":"IF('Be-Um-rechnung'!A29=2,Stoffdaten!AA2*0.0166666667,0)","v":0},{"$f":"IF('Be-Um-rechnung'!A29=3,Stoffdaten!AA2*1,0)","v":1.1616644738483843},{"$f":"IF('Be-Um-rechnung'!A29=4,Stoffdaten!AA2*0.5885778,0)","v":0},null,null,"m³/h",{"$f":"IF('Be-Um-rechnung'!A29=1,Stoffdaten!AF2*0.27777778,0)","v":0},{"$f":"IF('Be-Um-rechnung'!A29=2,Stoffdaten!AF2*0.0166666667,0)","v":0},{"$f":"IF('Be-Um-rechnung'!A29=3,Stoffdaten!AF2*1,0)","v":1.1404884503425887},{"$f":"IF('Be-Um-rechnung'!A29=4,Stoffdaten!AF2*0.5885778,0)","v":0}]
[]
[]
[null,null,null,null,null,null,null,null,null,null,null,"Größe","V_max in m³/h","TYP K-MT","Düse ohne ZHM","Düse mit ZHM","Behälter-volumen m³","Trockenmittel/Behälter MS4A [kg]","Schüttvolumen","Dimensionen\n(AxBxC)\n[mm]","Gewicht\n[kg]","Anschluß","max. Betriebsdruck",null,null,"Berechnung mögliche variable Zeit bei Trocknergrösse 20 für nominale Belastung",null,null,null,null,null,"Berechnung mögliche variable Zeit für minnimale Last"]
[null,null,null,null,null,null,null,null,null,null,null,0,0,1,"---","---",null,null,null,null,null,null,null,null,null,{"$f":"M2*$D$156","v":8.0000000999999994},"Eintritt m³/h",null,null,null,null,{"$f":"'Be-Um-rechnung'!C3","v":8},{"$f":"AA9","v":"Eintritt m³/h"},null,null,null,null,null,null,0,5,null,null,null,4]
[null,null,"Trockner-Eintrittstemperatur in °F",null,null,null,null,null,null,null,null,1,8.0000000999999994,2,0.7,0.7,1E-3,0.8,1.17,"326 x 400 x 216",11.5,"1/4  \"",16,null,null,35,"Eintritt °C",null,null,null,null,{"$f":"'Be-Um-rechnung'!C5","v":35},{"$f":"AA10","v":"Eintritt °C"},null,null,null,null,null,null,40.1,4,null,null,null,3]
["Für einen Drucktaupunkt",null,{"$f":"C13*1.8+32","v":77},86,95,104,113,122,null,null,null,2,15.000000099999999,3,0.9,0.9,2E-3,1.7,2.2000000000000002,"326 x 575 x 216",15.5,"1/4 \"",16,null,null,{"$f":"(273.15+35)/(273.15+20)","v":1.0511683438512707},"v korrektur in Nm³",null,null,null,null,{"$f":"(273.15+AF10)/(273.15+20)","v":1.0511683438512707},"v korrektur in Nm³",null,null,null,null,null,null,45.1,3,null,null,null,2]
["von -25 °C und -40 °C",null,"Trockner-Eintrittstemperatur in °C",null,null,null,null,null,null,null,null,3,25.000000100000001,4,1.1000000000000001,1.1000000000000001,4.0000000000000001E-3,2.7,3.6,"326 x 825 x 216",20,"1/4 \"",16,null,null,{"$f":"Z9*Z11","v":8.4093468559269997},"  Nm³/h",null,null,null,null,{"$f":"AF9*AF11","v":8.4093467508101654},"  Nm³/h",null,null,null,null,null,null,50.1,3,null,null,null,2]
["Mindest-Betriebsdruck",null,25,30,35,40,45,50,null,null,null,4,35.000000100000001,6,1.3,1.3,5.0000000000000001E-3,3.9,5.0999999999999996,"326 x 1075 x 216",25,"1/4 \"",16,null,null,7,"bar (g)",null,null,null,null,{"$f":"'Be-Um-rechnung'!C4","v":7},"bar (g)",null,null,null,null,null,null,60.1,"ERROR",null,null,null,"ERROR"]
["in bar (e) oder (g)",null,1,2,3,4,5,6,null,null,null,6,56.000000100000001,7,1.7,1.7,8.9999999999999993E-3,6.5,8.6,"496 x 1203 x 300",48,"1/2 \"",16,null,null,{"$f":"Z12/(Z13+1)","v":1.051168356990875},"Betriebsvolumen  Nm³ / h",null,null,null,null,{"$f":"AF12/(AF13+1)","v":1.0511683438512707},"Betriebsvolumen  Nm³ / h"]
[null,5,0.8,0.79,0.75,0.64,0.61,0.59,null,null,null,7,72.000000099999994,8,1.9,1.9,1.0999999999999999E-2,8.1999999999999993,10.83,"496 x 1428 x 300",56.5,"1/2 \"",16,null,null,{"$f":"Z14/60","v":1.7519472616514584E-2},"Betriebsvolumen  Nm³ / min",null,null,null,null,{"$f":"AF14/60","v":1.7519472397521177E-2},"Betriebsvolumen  Nm³ / min",null,null,null,null,null,null,{"$f":"AF10","v":35},{"$f":"VLOOKUP(AN15,AN9:AO13,2)","v":5},null,null,null,{"$f":"VLOOKUP(AN15,AN9:AS13,6)","v":4}]
[null,6,0.92,0.91,0.89,0.78,0.73,0.67,null,null,null,8,86.000000099999994,10,2.1,2.1,1.2999999999999999E-2,9.6,12.55,"496 x 1628 x 300",62.5,"3/4 \"",16,null,null,{"$f":"C153","v":39.625629961318261},"Wasserfracht g / Nm³",null,null,null,null,{"$f":"C154","v":39.625629961318261},"Wasserfracht g / Nm³",null,null,null,null,null,null,1,{"$f":"AO15","v":5},null,null,1,{"$f":"AS15","v":4}]
[null,7,1.03,1.02,1,0.91,0.82,0.79,null,null,null,10,105.00000009999999,15,2.2999999999999998,2.5,0.02,13.9,20.170000000000002,"870 x 1420 x 490",120,"1 \"",16,null,null,{"$f":"(Z15*Z16)/1000","v":6.9422013901945508E-4},"kg / min",null,null,null,null,{"$f":"(AF15*AF16)/1000","v":6.9422013034170342E-4},"kg / min",null,null,null,null,null,null,2,3,null,null,2,2]
[null,8,1.1599999999999999,1.1499999999999999,1.1299999999999999,1,0.94,0.86,null,null,null,15,145.00000009999999,20,2.8,3.1,2.5999999999999999E-2,18.3,26.42,"870 x 1750 x 490",142,"1 \"",16,null,null,{"$f":"'Be-Um-rechnung'!C6","v":-40},"Dtp.",null,null,null,null,{"$f":"'Be-Um-rechnung'!C6","v":-40},"Dtp.",null,null,null,null,null,null,3,4,null,null,3,3]
[null,9,1.3,1.28,1.26,1.08,1.03,0.99,null,null,null,20,200.00000009999999,25,3.4,3.4,4.2999999999999997E-2,22.8,33.01,"670 x 1530 x 490",143,"1 \"",16,null,null,{"$f":"IF('Be-Um-rechnung'!C6=-70,Stoffdaten!A32,Stoffdaten!B32)","v":0.45},"Beladungsfaktor",null,null,null,null,{"$f":"Z19","v":0.45},"Beladungsfaktor",null,null,null,null,null,null,4,5,null,null,4,4]
[null,10,1.39,1.37,1.31,1.1599999999999999,1.07,1.03,null,null,null,25,255.00000009999999,35,3.7,3.7,4.3999999999999997E-2,30.3,43.8,"670 x 1760 x 530",173,"1 1/2  \"",16,null,null,{"$f":"(Z17/Z19)*100","v":0.15427114200432335},"kg TroMi erf. / min Ads.-Zeit",null,null,null,null,{"$f":"(AF17/AF19)*100","v":0.15427114007593409},"kg TroMi erf. / min Ads.-Zeit",null,null,null,null,null,null,5,6,null,null,5,5]
{"$rows_left_out":139}
{"sheet":"ArtikelNr.","index":4,"n_rows":27,"n_cols":14,"rows_kept":27,"cut":false,"hidden":true,"merged":[]}
[1,2,3,4,5,6,7,8,9,10,11,12,13,14]
[null,"Trockner-BestellNr.","Trockner-BestellNr.","Blendenkit","Taupunktmessung","Signaldoppler","Reg.Gas-Rückführung","Anfahrvorrichtung","Feinfilterschalldämpfer"]
[{"$f":"VLOOKUP(Stoffdaten!N2,ArtikelNr.!A4:G19,1)","v":1},{"$f":"VLOOKUP(Stoffdaten!N2,ArtikelNr.!A4:G27,2)","v":"K1/16D2-G230M"},{"$f":"VLOOKUP(Stoffdaten!N2,ArtikelNr.!A4:G27,3)","v":"K1/16D2-G230MT"},{"$f":"VLOOKUP(Stoffdaten!N2,ArtikelNr.!A4:G27,4)","v":"VASNOZ/K1-K95"},{"$f":"VLOOKUP(Stoffdaten!N2,ArtikelNr.!A4:G27,5)","v":"VASPDP/K1-K95"},{"$f":"VLOOKUP(Stoffdaten!N2,ArtikelNr.!A4:G27,6)","v":"VASMBS420"},{"$f":"VLOOKUP(Stoffdaten!N2,ArtikelNr.!A4:N27,7)","v":"VASRGR/K1-K8"},{"$f":"VLOOKUP(Stoffdaten!N2,ArtikelNr.!A4:N27,8)","v":"VASVPB/K1-K4/08"},{"$f":"VLOOKUP(Stoffdaten!N2,ArtikelNr.!A4:N27,9)","v":"VASFS3/K1-K4"}]
[1,"K1/16D2-G230M","K1/16D2-G230MT","VASNOZ/K1-K95","VASPDP/K1-K95","VASMBS420","VASRGR/K1-K8","VASVPB/K1-K4/08","VASFS3/K1-K4"]
[2,"K2/16D2-G230M","K2/16D2-G230MT","VASNOZ/K1-K95","VASPDP/K1-K95","VASMBS420","VASRGR/K1-K8","VASVPB/K1-K4/08","VASFS3/K1-K4"]
[3,"K3/16D2-G230M","K3/16D2-G230MT","VASNOZ/K1-K95","VASPDP/K1-K95","VASMBS420","VASRGR/K1-K8","VASVPB/K1-K4/08","VASFS3/K1-K4"]
[4,"K4/16D2-G230M","K4/16D2-G230MT","VASNOZ/K1-K95","VASPDP/K1-K95","VASMBS420","VASRGR/K1-K8","VASVPB/K1-K4/08","VASFS3/K1-K4"]
[6,"K6/16D2-G230M","K6/16D2-G230MT","VASNOZ/K1-K95","VASPDP/K1-K95","VASMBS420","VASRGR/K1-K8","VASVPB/K6-K7/15","VASFS3/K6-K8"]
[7,"K7/16D2-G230M","K7/16D2-G230MT","VASNOZ/K1-K95","VASPDP/K1-K95","VASMBS420","VASRGR/K1-K8","VASVPB/K6-K7/15","VASFS3/K6-K8"]
[8,"K8/16D2-G230M","K8/16D2-G230MT","VASNOZ/K1-K95","VASPDP/K1-K95","VASMBS420","VASRGR/K1-K8","VASVPB/K8/20","VASFS3/K6-K8"]
[10,"K10/16D2-G230M","K10/16D2-G230MT","VASNOZ/K1-K95","VASPDP/K1-K95","VASMBS420","VASRGR/K10-K95","VASVPB/K10-K20/25","VASFS3/K10-K15"]
[15,"K15/16D2-G230M","K15/16D2-G230MT","VASNOZ/K1-K95","VASPDP/K1-K95","VASMBS420","VASRGR/K10-K95","VASVPB/K10-K20/25","VASFS3/K10-K15"]
[20,"K20/16D2-G230M","K20/16D2-G230MT","VASNOZ/K1-K95","VASPDP/K1-K95","VASMBS420","VASRGR/K10-K95","VASVPB/K10-K20/25","VASFS3/K20-K25"]
[25,"K25/16D2-G230M","K25/16D2-G230MT","VASNOZ/K1-K95","VASPDP/K1-K95","VASMBS420","VASRGR/K10-K95","VASVPB/K25-K45/40","VASFS3/K20-K25"]
[35,"K35/16D2-G230M","K35/16D2-G230MT","VASNOZ/K1-K95","VASPDP/K1-K95","VASMBS420","VASRGR/K10-K95","VASVPB/K25-K45/40","VASFS3/K35-K60"]
[45,"K45/16D2-G230M","K45/16D2-G230MT","VASNOZ/K1-K95","VASPDP/K1-K95","VASMBS420","VASRGR/K10-K95","VASVPB/K25-K45/40","VASFS3/K35-K60"]
[60,"K60/16D2-G230M","K60/16D2-G230MT","VASNOZ/K1-K95","VASPDP/K1-K95","VASMBS420","VASRGR/K10-K95","VASVPB/K60-K75/50","VASFS3/K35-K60"]
[75,"K75/16D2-G230M","K75/16D2-G230MT","VASNOZ/K1-K95","VASPDP/K1-K95","VASMBS420","VASRGR/K10-K95","VASVPB/K60-K75/50","VASFS3/K75-K95"]
[95,"K95/16D2-G230M","K95/16D2-G230MT","VASNOZ/K1-K95","VASPDP/K1-K95","VASMBS420","VASRGR/K10-K95","VASVPB/K95/65","VASFS3/K75-K95"]
[120,"K120/10D1-F230M","K120/10D1-F230MT",{"$f":"Language!D30","v":"Please consult Parker!"},{"$f":"Language!D30","v":"Please consult Parker!"},{"$f":"Language!D30","v":"Please consult Parker!"},{"$f":"Language!D30","v":"Please consult Parker!"},{"$f":"Language!D30","v":"Please consult Parker!"},{"$f":"Language!D30","v":"Please consult Parker!"}]
{"$rows_left_out":8}
{"sheet":"Language","index":5,"n_rows":50,"n_cols":13,"rows_kept":50,"cut":false,"hidden":true,"merged":[]}
[]
[null,null,null,{"$f":"Cover!C2","v":2},"Deutsch","English","Français","Italiano","Español","Polish","…","…","…"]
[null,null,1,"Auswahl",1,2,3,4,5,6,7,8,9]
[null,null,{"$f":"C3+1","v":2},{"$f":"HLOOKUP($D$2,Language!$E$3:M50,C4)","v":"Ambient temperature"},"Umgebungstemperatur","Ambient temperature","Temp Ambiante","Temperatura ambiente","Temperatura ambiente","Temperatura otoczenia"]
[null,null,{"$f":"C4+1","v":3},{"$f":"HLOOKUP($D$2,Language!$E$3:M51,C5)","v":"Compressed air flow rate \nat 20°C and 1 bar a"},"Volumenstrom bezogen \nauf 20°C und 1 bar a","Compressed air flow rate \nat 20°C and 1 bar a","Débit air comprimé \nà 20°C et 1 bar abs","Portata riferita \na 20°C e 1 bar ass.","Caudal de aire comprimido \na 20°C y 1 bar de presión absoluta ","Strumień sprężonego powietrza odniesiony \ndo 20°C i 1 bar a"]
[null,null,{"$f":"C5+1","v":4},{"$f":"HLOOKUP($D$2,Language!$E$3:M52,C6)","v":"Compressor discharge pressure"},"minimaler Betriebsdruck","Compressor discharge pressure","Pression sortie compresseur","Minima pressione di esercizio","Presión de descarga del compresor","Minimalne ciśnienie robocze"]
[null,null,{"$f":"C6+1","v":5},{"$f":"HLOOKUP($D$2,Language!$E$3:M53,C7)","v":"Minimum inlet pressure"},"minimaler Eintrittsdruck","Minimum inlet pressure","Pression entrée mini","Minima pressione in ingresso","Presión mínima de entrada","Minimalne ciśnienie na wlocie"]
[null,null,6,{"$f":"HLOOKUP($D$2,Language!$E$3:M54,C8)","v":"Maximum inlet temperature"},"maximale Eintrittstemperatur","Maximum inlet temperature","T°C entrée maxi","Massima temperatura in ingresso","Temperatura máxima de entrada","Maksymalne ciśnienie na wlocie"]
[null,null,{"$f":"C8+1","v":7},{"$f":"HLOOKUP($D$2,Language!$E$3:M55,C9)","v":"Outlet pressure dewpoint"},"Drucktaupunkt","Outlet pressure dewpoint","PDR sous pression requis","Punto di rugiada in pressione","Salida punto de rocío a presión","Ciśnieniowy punkt rosy"]
[null,null,{"$f":"C9+1","v":8},{"$f":"HLOOKUP($D$2,Language!$E$3:M56,C10)","v":"Out of range! Use 25 - 50°C or 77 - 122°F"},"Außerhalb des Bereiches von 25 - 50°C oder 77 - 122°F ","Out of range! Use 25 - 50°C or 77 - 122°F","Hors Standard ! Choisir dans la plage25 - 50°C ou 77 - 122°F","Fuori range ! Selez. da 25 - 50 °C oppure 77 - 122 °F","Fuera de rango ! Usar 25 - 50°C o 77 - 122 °F","Poza zakresem! Wybierz od 25 do 50°C lub 77 - 122 °F"]
[null,null,{"$f":"C10+1","v":9},{"$f":"HLOOKUP($D$2,Language!$E$3:M57,C11)","v":"Dryer must be sized by Parker!"},"Trockner im Werk anfragen!","Dryer must be sized by Parker!","Le sécheur doit être déterminé par Parker!","Selezione dell'essiccatore a cura Parker!","El secador debe ser dimensionado por Parker!","Osuszacz musi być dobrany fabrycznie!"]
[null,null,10,{"$f":"HLOOKUP($D$2,Language!$E$3:M58,C12)","v":"Language choice"},"Sprachauswahl","Language choice","Choix du langage","Scelta della lingua","Selección de idioma","Wybór języka"]
[null,null,11,{"$f":"HLOOKUP($D$2,Language!$E$3:M59,C13)","v":"Please enter only one pressure value!"},"Bitte nur einen Druckwert eingeben!","Please enter only one pressure value!","Merci de n'entrer qu'une seule valeur de pression","Inserire solo un valore di pressione","Por favor introduzca un único valor de presión","Proszę wprowadzić tylko jedną wartość ciśnienia !"]
[null,null,12,{"$f":"HLOOKUP($D$2,Language!$E$3:M60,C14)","v":"Dryer in accordance with standard specification"},"Trockner in der Standard Ausführung","Dryer in accordance with standard specification","Sécheur conforme aux spécifications standards","Essiccatore in accordo a specifiche standard","Secador conforme a la especificación standard","Osuszacz w standardowym wykonaniu"]
[null,null,13,{"$f":"HLOOKUP($D$2,Language!$E$3:M61,C15)","v":"Dryer choice with input data"},"Trocknerwahl mit Ihren Eingabedaten","Dryer choice with input data","Sélection Sécheur en fonction des données d'entrée","Scelta essiccatore sulla base dei dati cliente","Elección del secador con los datos de entrada","Dobór osuszacza według podanych wartości wejściowych"]
[null,null,14,{"$f":"HLOOKUP($D$2,Language!$E$3:M62,C16)","v":"Standard orifice Ø"},"Ø Blende im Standard","Standard orifice Ø"," Ø orifice standard ","Orifizio calibrato standard","Orificio standard Ø","Otwór standardowy  Ø"]
[null,null,15,{"$f":"HLOOKUP($D$2,Language!$E$3:M63,C17)","v":"Without dew-point dependant-switching \n(fixed cycle)"},"ohne Taupunkt-Steuerung \n(fester Zyklus)","Without dew-point dependant-switching \n(fixed cycle)","Cycles fixes \n(indépendants du PDR)","Senza controllo punto di rugiada \n(cicli fissi)","Sin control por punto de rocío \n(Ciclo fijo)","Bez sterowania zwrotnego \nod punktu rosy"]
[null,null,16,{"$f":"HLOOKUP($D$2,Language!$E$3:M64,C18)","v":"With dew-point dependant-switching \n(variable cycle)"},"mit Taupunkt-Steuerung ZHM 100 \n(variabler Zyklus)","With dew-point dependant-switching \n(variable cycle)","Cycles variables \n(dépendants du PDR)","Con controllo punto di rugiada \n(cicli variabili)","Con control por punto de rocío \n(Ciclo variable)","Ze sterowaniem zwrotnym \nod punktu rosy"]
[null,null,17,{"$f":"HLOOKUP($D$2,Language!$E$3:M65,C19)","v":"Average purge-air consumption"},"Regenerationsluftbedarf im Durchschnitt","Average purge-air consumption","Consommation moyenne d'air de régénération","Consumo medio aria di rigenerazione","Promedio consumo de aire de purga","Średnie zużycie powietrza na regeneracje"]
[null,null,18,{"$f":"HLOOKUP($D$2,Language!$E$3:M66,C20)","v":"Order Number/Catalogue Number"},"Bestellnummer/Katalognummer","Order Number/Catalogue Number","Réf catalogue","Numero ordine/Numero catalogo","Número de pedido/Número de catálogo","Numer zamówieniowy / Numer katalogowy"]
{"$rows_left_out":31}
{"sheet":"Be-Um-rechnung","index":6,"n_rows":39,"n_cols":12,"rows_kept":39,"cut":false,"hidden":true,"merged":[]}
["Auslegungsprogramm K-MT 1-8, K-MT 10-95 und K-MT 120-600"]
[]
[{"$f":"Input!A15","v":"Compressed air flow rate \nat 20°C and 1 bar a"},null,{"$f":"H23","v":8},"m³/h"]
[{"$f":"Input!F5","v":"Minimum inlet pressure"},null,{"$f":"F20","v":7},"bar g",null,null,null,null,null,{"$f":"IF(OR(C4<5,C4>15),0,1)","v":1}]
[{"$f":"Input!F25","v":"Maximum inlet temperature"},null,{"$f":"F14","v":35},"°C",null,null,null,null,null,{"$f":"IF(OR(C5<25,C5>50),0,1)","v":1}]
[{"$f":"Input!I25","v":"Outlet pressure dewpoint"},null,{"$f":"IF(L39=-40,-40,-70)","v":-40},"°C"]
["Temperaturdifferenz",null,{"$f":"C5-C6","v":75},"°C",null,null,null,null,null,{"$f":"IF(C7>105,0,1)","v":1}]
["Korrekturfaktor K =",null,{"$f":"Stoffdaten!G2","v":1},"-",null,null,null,null,null,{"$f":"C8","v":1}]
["Volumenstrom V_gerechnet =",null,{"$f":"IF(C8=0,-1,C3/C8)","v":8},"m³/h",null,null,null,null,null,{"$f":"C9","v":8}]
[null,null,null,null,null,null,null,null,null,{"$f":"IF(AND(J4=1,J5=1,J7=1),SUM(J4:J9),0)","v":12},"0 = not OK",">= 1 = OK"]
["Temperatur",null,"Einheit"]
[1,null,"°C"]
[2,null,"°F"]
[1,{"$f":"Input!F26","v":35},{"$f":"VLOOKUP(A14,A12:C13,3)","v":"°C"},{"$f":"IF(A14=1,Input!F26,((Input!F26-32)*5/9))","v":35},"°C",{"$f":"IF(A14=1,ROUNDUP(Input!F26*2,-1)/2,(ROUNDUP(((Input!F26-32)*5/9)*2,-1)/2))","v":35},"°C"]
[]
[]
["Druck",null,"Einheit"]
[1,null,"bar g"]
[2,null,"psi g"]
[1,{"$f":" Input!F6","v":7},{"$f":"VLOOKUP(A20,A18:C19,3)","v":"bar g"},null,null,{"$f":"IF(A20=1,Input!F6,(Input!F6*0.06894757))","v":7},"bar g"]
{"$rows_left_out":20}
{"sheet":"Düsen Blendenkit","index":7,"n_rows":61,"n_cols":8,"rows_kept":61,"cut":false,"hidden":true,"merged":[[11,0,26,0],[28,0,43,0],[45,0,60,0]]}
[null,"Eintrittstemperatur:","max. 35 °C"]
[null,"Drucktaupunkt:","-40°C"]
[{"$f":"'Be-Um-rechnung'!C5","v":35},{"$f":"IF('Be-Um-rechnung'!C5=35,1,0)","v":1}]
[{"$f":"'Be-Um-rechnung'!C4","v":7},{"$f":"HLOOKUP(A4,C8:G9,2)","v":2}]
["K-MT",{"$f":"Stoffdaten!N2","v":1},{"$f":"VLOOKUP(Stoffdaten!N2,'Düsen Blendenkit'!B12:M27,1)","v":1}]
[]
[null,"gerechnet für ",5,7,10,12,"13,5-15","bar ü"]
[null,"kleinster Druck",0,6,8.1,11,13]
[null,null,1,2,3,4,5]
[null,"Größe","Blende","Blende","Blende","Blende","Blende"]
[null,null,"mm","mm","mm","mm","mm"]
["mit Multitronic",1,0.7,0.7,0.5,0.5,0.5]
[null,2,1.1000000000000001,0.9,0.7,0.7,0.7]
[null,3,1.3,1.1000000000000001,1.1000000000000001,0.9,0.9]
[null,4,1.5,1.3,1.1000000000000001,1.1000000000000001,1.1000000000000001]
[null,6,1.9,1.7,1.5,1.3,1.3]
[null,7,2.1,1.9,1.7,1.5,1.5]
[null,8,2.4,2.1,1.9,1.7,1.7]
[null,10,2.8,2.2999999999999998,2.1,1.9,1.9]
[null,15,3.1,2.8,2.5,2.1,1.9]
{"$rows_left_out":41}